[INFO]
[INFO] -----------------------< com.artfess:easy-excel >-----------------------
[INFO] Building easy-excel 1.0 [26/33]
[INFO] --------------------------------[ jar ]---------------------------------
[INFO]
[INFO] --- maven-clean-plugin:2.5:clean (default-clean) @ easy-excel ---
[INFO] Deleting D:\jenkins\workspace\jd_gyl_java\bpm-tools\easy-excel\target
[INFO]
[INFO] --- maven-resources-plugin:2.7:resources (default-resources) @ easy-excel ---
[INFO] Using 'UTF-8' encoding to copy filtered resources.
[INFO] skip non existing resourceDirectory D:\jenkins\workspace\jd_gyl_java\bpm-tools\easy-excel\src\main\resources
[INFO] skip non existing resourceDirectory D:\jenkins\workspace\jd_gyl_java\lib
[INFO]
[INFO] --- maven-compiler-plugin:3.8.1:compile (default-compile) @ easy-excel ---
[INFO] Changes detected - recompiling the module!
[INFO] Compiling 25 source files to D:\jenkins\workspace\jd_gyl_java\bpm-tools\easy-excel\target\classes
[INFO]
[INFO] --- maven-resources-plugin:2.7:testResources (default-testResources) @ easy-excel ---
[INFO] Using 'UTF-8' encoding to copy filtered resources.
[INFO] skip non existing resourceDirectory D:\jenkins\workspace\jd_gyl_java\bpm-tools\easy-excel\src\test\resources
[INFO]
[INFO] --- maven-compiler-plugin:3.8.1:testCompile (default-testCompile) @ easy-excel ---
[INFO] No sources to compile
[INFO]
[INFO] --- maven-surefire-plugin:2.7.2:test (default-test) @ easy-excel ---
[INFO] Tests are skipped.
[INFO]
[INFO] --- maven-jar-plugin:2.4:jar (default-jar) @ easy-excel ---
[INFO] Building jar: D:\jenkins\workspace\jd_gyl_java\bpm-tools\easy-excel\target\easy-excel-1.0.jar
[INFO] ------------------------------------------------------------------------
[INFO] Reactor Summary for jd_gyl 1.0:
[INFO]
[INFO] jd_gyl ............................................. SUCCESS [ 1.421 s]
[INFO] uc-api ............................................. SUCCESS [ 4.470 s]
[INFO] bpm-base ........................................... SUCCESS [ 32.422 s]
[INFO] redis .............................................. SUCCESS [ 3.813 s]
[INFO] uc-api-impl ........................................ SUCCESS [ 4.016 s]
[INFO] job ................................................ SUCCESS [ 4.922 s]
[INFO] activemq ........................................... SUCCESS [ 3.781 s]
[INFO] poi ................................................ SUCCESS [ 6.937 s]
[INFO] sysConfig .......................................... SUCCESS [ 31.338 s]
[INFO] file ............................................... SUCCESS [ 15.094 s]
[INFO] mail ............................................... SUCCESS [ 7.533 s]
[INFO] i18n ............................................... SUCCESS [ 5.016 s]
[INFO] service ............................................ SUCCESS [ 7.172 s]
[INFO] rest-auth-service .................................. SUCCESS [ 2.671 s]
[INFO] ueditor ............................................ SUCCESS [ 2.656 s]
[INFO] elasticsearch ...................................... SUCCESS [ 9.093 s]
[INFO] bpm-tools .......................................... SUCCESS [ 0.000 s]
[INFO] integrate .......................................... SUCCESS [ 6.172 s]
[INFO] table .............................................. SUCCESS [ 7.989 s]
[INFO] bo ................................................. SUCCESS [ 7.019 s]
[INFO] bpm ................................................ SUCCESS [ 49.662 s]
[INFO] activiti ........................................... SUCCESS [ 19.790 s]
[INFO] report ............................................. SUCCESS [ 8.485 s]
[INFO] mongodb ............................................ SUCCESS [ 3.375 s]
[INFO] rabbitmq ........................................... SUCCESS [ 1.516 s]
[INFO] easy-excel ......................................... SUCCESS [ 8.737 s]
[INFO] bpm-api ............................................ SUCCESS [ 0.000 s]
[INFO] bpm-userCenter-server .............................. SUCCESS [ 36.277 s]
[INFO] bpm-systemConfig-server ............................ SUCCESS [ 13.110 s]
[INFO] bpm-formDesign-server .............................. SUCCESS [ 18.328 s]
[INFO] bpm-application-server ............................. SUCCESS [ 16.895 s]
[INFO] biz-gyl-server ..................................... SUCCESS [ 50.368 s]
[INFO] bpm-assembly ....................................... FAILURE [ 4.863 s]
[INFO] ------------------------------------------------------------------------
[INFO] BUILD FAILURE
[INFO] ------------------------------------------------------------------------
[INFO] Total time: 07:14 min
[INFO] Finished at: 2025-11-30T04:34:24+08:00
[INFO] ------------------------------------------------------------------------
[WARNING] The requested profile "offical" could not be activated because it does not exist.
Waiting for Jenkins to finish collecting data
[ERROR] Failed to execute goal on project bpm-assembly: Could not resolve dependencies for project com.artfess:bpm-assembly:jar:1.0: Could not find artifact com.artfess:bpm-workflow-server:jar:1.0 in hotent-remote (http://www.hotent.xyz:8081/nexus/repository/maven-public/) -> [Help 1]
[ERROR]
[ERROR] To see the full stack trace of the errors, re-run Maven with the -e switch.
[ERROR] Re-run Maven using the -X switch to enable full debug logging.
[ERROR]
[ERROR] For more information about the errors and possible solutions, please read the following articles:
[ERROR] [Help 1] http://cwiki.apache.org/confluence/display/MAVEN/DependencyResolutionException
[ERROR]
[ERROR] After correcting the problems, you can resume the build with the command
[ERROR] mvn <goals> -rf :bpm-assembly